Target
1-phosphatidylinositol 4,5-bisphosphate phosphodiesterase beta-3
Ligand
BDBM114285
Substrate
Meas. Tech.
Fluorescence-based biochemical high throughput dose response assay to identify inhibitors of phospholipase C isozymes (PLC-B3)
IC50
122478±n/a nM
Citation
 PubChem, PC Fluorescence-based biochemical high throughput dose response assay to identify inhibitors of phospholipase C isozymes (PLC-B3) PubChem Bioassay (2014)[AID] 
Target
Name:
1-phosphatidylinositol 4,5-bisphosphate phosphodiesterase beta-3
Synonyms:
PLCB3 Phospholipase C, beta 3 (phosphatidylinositol-specific) | Phospholipase C-beta-3
Type:
PROTEIN
Mol. Mass.:
138786.29
Organism:
Homo sapiens (Human)
Description:
EBI_12586
Residue:
1234
  
Inhibitor
Name:
BDBM114285
Synonyms:
MLS001160676 [3-[4-(4-fluorophenyl)piperazin-1-yl]sulfonylphenyl]-[3-(trifluoromethyl)piperidin-1-yl]methanone [3-[[4-(4-fluorophenyl)-1-piperazinyl]sulfonyl]phenyl]-[3-(trifluoromethyl)-1-piperidinyl]methanone | cid_24981619
Type:
Small organic molecule
Emp. Form.:
C23H25F4N3O3S
Mol. Mass.:
499.522
SMILES:
Fc1ccc(cc1)N1CCN(CC1)S(=O)(=O)c1cccc(c1)C(=O)N1CCCC(C1)C(F)(F)F
: