Target
1-phosphatidylinositol 4,5-bisphosphate phosphodiesterase beta-3
Ligand
BDBM80810
Substrate
Meas. Tech.
Fluorescence-based biochemical high throughput dose response assay to identify inhibitors of phospholipase C isozymes (PLC-B3)
IC50
122373±n/a nM
Citation
 PubChem, PC Fluorescence-based biochemical high throughput dose response assay to identify inhibitors of phospholipase C isozymes (PLC-B3) PubChem Bioassay (2014)[AID] 
Target
Name:
1-phosphatidylinositol 4,5-bisphosphate phosphodiesterase beta-3
Synonyms:
PLCB3 Phospholipase C, beta 3 (phosphatidylinositol-specific) | Phospholipase C-beta-3
Type:
PROTEIN
Mol. Mass.:
138786.29
Organism:
Homo sapiens (Human)
Description:
EBI_12586
Residue:
1234
  
Inhibitor
Name:
BDBM80810
Synonyms:
7-amino-6-chloro-5,8-diketo-naphthalene-2-sulfonamide 7-amino-6-chloro-5,8-dioxonaphthalene-2-sulfonamide MLS002667101 cid_240739
Type:
Small organic molecule
Emp. Form.:
C10H7ClN2O4S
Mol. Mass.:
286.692
SMILES:
NC1=C(Cl)C(=O)c2ccc(cc2C1=O)S(N)(=O)=O
: