Target
1-phosphatidylinositol 4,5-bisphosphate phosphodiesterase gamma-1 [1-999,I813T]
Ligand
BDBM80404
Substrate
Meas. Tech.
Counterscreen for inhibitors of phospholipase C isozymes (PLC-B3): Fluorescence-based biochemical high throughput dose response assay to identify inhibitors of phospholipase C isozymes (PLC-gamma1)
IC50
122457±n/a nM
Citation
 PubChem, PC Counterscreen for inhibitors of phospholipase C isozymes (PLC-B3): Fluorescence-based biochemical high throughput dose response assay to identify inhibitors of phospholipase C isozymes (PLC-gamma1) PubChem Bioassay (2014)[AID] 
Target
Name:
1-phosphatidylinositol 4,5-bisphosphate phosphodiesterase gamma-1 [1-999,I813T]
Synonyms:
PLC1 PLCG1_HUMAN | Phospholipase C, gamma 1
Type:
Enzyme Catalytic Domain
Mol. Mass.:
115282.60
Organism:
Homo sapiens (Human)
Description:
gi_223459640
Residue:
999
  
Inhibitor
Name:
BDBM80404
Synonyms:
2-(2-methyl-1,3-dioxolan-2-yl)-N'-[(E)-(5-nitro-2-oxidanyl-4-oxidanylidene-cyclohexa-2,5-dien-1-ylidene)methyl]ethanehydrazide N'-{2,4-dihydroxy-5-nitrobenzylidene}-2-(2-methyl-1,3-dioxolan-2-yl)acetohydrazide N'-[(E)-(2-hydroxy-5-nitro-4-oxo-1-cyclohexa-2,5-dienylidene)methyl]-2-(2-methyl-1,3-dioxolan-2-yl)acetohydrazide SMR000113316 | cid_5410765
Type:
Small organic molecule
Emp. Form.:
C13H15N3O7
Mol. Mass.:
325.2741
SMILES:
CC1(CC(=O)N[NH+]=C[c-]2cc([N+]([O-])=O)c(=O)cc2O)OCCO1
: