Target
1-phosphatidylinositol 4,5-bisphosphate phosphodiesterase gamma-1 [1-999,I813T]
Ligand
BDBM77413
Substrate
Meas. Tech.
Counterscreen for inhibitors of phospholipase C isozymes (PLC-B3): Fluorescence-based biochemical high throughput dose response assay to identify inhibitors of phospholipase C isozymes (PLC-gamma1)
IC50
122506±n/a nM
Citation
 PubChem, PC Counterscreen for inhibitors of phospholipase C isozymes (PLC-B3): Fluorescence-based biochemical high throughput dose response assay to identify inhibitors of phospholipase C isozymes (PLC-gamma1) PubChem Bioassay (2014)[AID] 
Target
Name:
1-phosphatidylinositol 4,5-bisphosphate phosphodiesterase gamma-1 [1-999,I813T]
Synonyms:
PLC1 PLCG1_HUMAN | Phospholipase C, gamma 1
Type:
Enzyme Catalytic Domain
Mol. Mass.:
115282.60
Organism:
Homo sapiens (Human)
Description:
gi_223459640
Residue:
999
  
Inhibitor
Name:
BDBM77413
Synonyms:
4-(benzenesulfonyl)-5-(4-fluorophenyl)-1-phenylpyrazole 5-(4-fluorophenyl)-1-phenyl-1H-pyrazol-4-yl phenyl sulfone MLS000546418 cid_1483453
Type:
Small organic molecule
Emp. Form.:
C21H15FN2O2S
Mol. Mass.:
378.419
SMILES:
Fc1ccc(cc1)-c1c(cnn1-c1ccccc1)S(=O)(=O)c1ccccc1
: