Target
1-phosphatidylinositol 4,5-bisphosphate phosphodiesterase gamma-1 [1-999,I813T]
Ligand
BDBM114239
Substrate
Meas. Tech.
Counterscreen for inhibitors of phospholipase C isozymes (PLC-B3): Fluorescence-based biochemical high throughput dose response assay to identify inhibitors of phospholipase C isozymes (PLC-gamma1)
IC50
122433±n/a nM
Citation
 PubChem, PC Counterscreen for inhibitors of phospholipase C isozymes (PLC-B3): Fluorescence-based biochemical high throughput dose response assay to identify inhibitors of phospholipase C isozymes (PLC-gamma1) PubChem Bioassay (2014)[AID] 
Target
Name:
1-phosphatidylinositol 4,5-bisphosphate phosphodiesterase gamma-1 [1-999,I813T]
Synonyms:
PLC1 PLCG1_HUMAN | Phospholipase C, gamma 1
Type:
Enzyme Catalytic Domain
Mol. Mass.:
115282.60
Organism:
Homo sapiens (Human)
Description:
gi_223459640
Residue:
999
  
Inhibitor
Name:
BDBM114239
Synonyms:
MLS000327632 N'-(4-chlorophenyl)-N-hydroxybenzenecarboximidamide N-(4-chlorophenyl)-N'-hydroxybenzenecarboximidamide cid_5100198
Type:
Small organic molecule
Emp. Form.:
C13H11ClN2O
Mol. Mass.:
246.692
SMILES:
ONC(=Nc1ccc(Cl)cc1)c1ccccc1
: