Target
1-phosphatidylinositol 4,5-bisphosphate phosphodiesterase gamma-1 [1-999,I813T]
Ligand
BDBM114262
Substrate
Meas. Tech.
Counterscreen for inhibitors of phospholipase C isozymes (PLC-B3): Fluorescence-based biochemical high throughput dose response assay to identify inhibitors of phospholipase C isozymes (PLC-gamma1)
IC50
122579±n/a nM
Citation
 PubChem, PC Counterscreen for inhibitors of phospholipase C isozymes (PLC-B3): Fluorescence-based biochemical high throughput dose response assay to identify inhibitors of phospholipase C isozymes (PLC-gamma1) PubChem Bioassay (2014)[AID] 
Target
Name:
1-phosphatidylinositol 4,5-bisphosphate phosphodiesterase gamma-1 [1-999,I813T]
Synonyms:
PLC1 PLCG1_HUMAN | Phospholipase C, gamma 1
Type:
Enzyme Catalytic Domain
Mol. Mass.:
115282.60
Organism:
Homo sapiens (Human)
Description:
gi_223459640
Residue:
999
  
Inhibitor
Name:
BDBM114262
Synonyms:
(-)-Ditryptophenaline SMR000469602 benzene-1,2-dicarboxylic acid bis[2-[2-(1H-indol-3-yl)ethylamino]-2-oxoethyl] ester bis[2-[2-(1H-indol-3-yl)ethylamino]-2-oxoethyl] benzene-1,2-dicarboxylate | cid_23640940
Type:
Small organic molecule
Emp. Form.:
C32H30N4O6
Mol. Mass.:
566.6038
SMILES:
O=C(COC(=O)c1ccccc1C(=O)OCC(=O)NCCc1c[nH]c2ccccc12)NCCc1c[nH]c2ccccc12
: