Target
1-phosphatidylinositol 4,5-bisphosphate phosphodiesterase gamma-1 [1-999,I813T]
Ligand
BDBM60912
Substrate
Meas. Tech.
Counterscreen for inhibitors of phospholipase C isozymes (PLC-B3): Fluorescence-based biochemical high throughput dose response assay to identify inhibitors of phospholipase C isozymes (PLC-gamma1)
IC50
122481±n/a nM
Citation
 PubChem, PC Counterscreen for inhibitors of phospholipase C isozymes (PLC-B3): Fluorescence-based biochemical high throughput dose response assay to identify inhibitors of phospholipase C isozymes (PLC-gamma1) PubChem Bioassay (2014)[AID] 
Target
Name:
1-phosphatidylinositol 4,5-bisphosphate phosphodiesterase gamma-1 [1-999,I813T]
Synonyms:
PLC1 PLCG1_HUMAN | Phospholipase C, gamma 1
Type:
Enzyme Catalytic Domain
Mol. Mass.:
115282.60
Organism:
Homo sapiens (Human)
Description:
gi_223459640
Residue:
999
  
Inhibitor
Name:
BDBM60912
Synonyms:
4-[3-[(5E)-5-(2-furfurylidene)-4-keto-2-thioxo-thiazolidin-3-yl]propanoylamino]-2-hydroxy-benzoic acid 4-[3-[(5E)-5-(furan-2-ylmethylidene)-4-oxo-2-sulfanylidene-1,3-thiazolidin-3-yl]propanoylamino]-2-hydroxybenzoic acid MLS001167187 cid_16428168
Type:
Small organic molecule
Emp. Form.:
C18H14N2O6S2
Mol. Mass.:
418.444
SMILES:
OC(=O)c1ccc(NC(=O)CCN2C(=S)S\C(=C\c3ccco3)C2=O)cc1O
: