Target
1-phosphatidylinositol 4,5-bisphosphate phosphodiesterase gamma-1 [1-999,I813T]
Ligand
BDBM114288
Substrate
Meas. Tech.
Counterscreen for inhibitors of phospholipase C isozymes (PLC-B3): Fluorescence-based biochemical high throughput dose response assay to identify inhibitors of phospholipase C isozymes (PLC-gamma1)
IC50
122492±n/a nM
Citation
 PubChem, PC Counterscreen for inhibitors of phospholipase C isozymes (PLC-B3): Fluorescence-based biochemical high throughput dose response assay to identify inhibitors of phospholipase C isozymes (PLC-gamma1) PubChem Bioassay (2014)[AID] 
Target
Name:
1-phosphatidylinositol 4,5-bisphosphate phosphodiesterase gamma-1 [1-999,I813T]
Synonyms:
PLC1 PLCG1_HUMAN | Phospholipase C, gamma 1
Type:
Enzyme Catalytic Domain
Mol. Mass.:
115282.60
Organism:
Homo sapiens (Human)
Description:
gi_223459640
Residue:
999
  
Inhibitor
Name:
BDBM114288
Synonyms:
4-formylbenzoic acid [2-[(6-amino-1-benzyl-2,4-diketo-pyrimidin-5-yl)-ethyl-amino]-2-keto-ethyl] ester MLS002182724 [2-[(6-amino-1-benzyl-2,4-dioxopyrimidin-5-yl)-ethylamino]-2-oxoethyl] 4-formylbenzoate cid_25163304
Type:
Small organic molecule
Emp. Form.:
C23H22N4O6
Mol. Mass.:
450.444
SMILES:
CCN(C(=O)COC(=O)c1ccc(C=O)cc1)c1c(N)n(Cc2ccccc2)c(=O)[nH]c1=O
: