Target
1-phosphatidylinositol 4,5-bisphosphate phosphodiesterase gamma-1 [1-999,I813T]
Ligand
BDBM114291
Substrate
Meas. Tech.
Counterscreen for inhibitors of phospholipase C isozymes (PLC-B3): Fluorescence-based biochemical high throughput dose response assay to identify inhibitors of phospholipase C isozymes (PLC-gamma1)
IC50
122486±n/a nM
Citation
 PubChem, PC Counterscreen for inhibitors of phospholipase C isozymes (PLC-B3): Fluorescence-based biochemical high throughput dose response assay to identify inhibitors of phospholipase C isozymes (PLC-gamma1) PubChem Bioassay (2014)[AID] 
Target
Name:
1-phosphatidylinositol 4,5-bisphosphate phosphodiesterase gamma-1 [1-999,I813T]
Synonyms:
PLC1 PLCG1_HUMAN | Phospholipase C, gamma 1
Type:
Enzyme Catalytic Domain
Mol. Mass.:
115282.60
Organism:
Homo sapiens (Human)
Description:
gi_223459640
Residue:
999
  
Inhibitor
Name:
BDBM114291
Synonyms:
8-(3,4,5-trihydroxy-6-keto-xanthen-9-yl)-1-naphthoic acid 8-(3,4,5-trihydroxy-6-oxoxanthen-9-yl)naphthalene-1-carboxylic acid MLS002706942 cid_274108
Type:
Small organic molecule
Emp. Form.:
C24H14O7
Mol. Mass.:
414.3638
SMILES:
OC(=O)c1cccc2cccc(-c3c4ccc(O)c(O)c4oc4c(O)c(=O)ccc34)c12
: