Target
1-phosphatidylinositol 4,5-bisphosphate phosphodiesterase gamma-1 [1-999,I813T]
Ligand
BDBM114294
Substrate
Meas. Tech.
Counterscreen for inhibitors of phospholipase C isozymes (PLC-B3): Fluorescence-based biochemical high throughput dose response assay to identify inhibitors of phospholipase C isozymes (PLC-gamma1)
IC50
30384±n/a nM
Citation
 PubChem, PC Counterscreen for inhibitors of phospholipase C isozymes (PLC-B3): Fluorescence-based biochemical high throughput dose response assay to identify inhibitors of phospholipase C isozymes (PLC-gamma1) PubChem Bioassay (2014)[AID] 
Target
Name:
1-phosphatidylinositol 4,5-bisphosphate phosphodiesterase gamma-1 [1-999,I813T]
Synonyms:
PLC1 PLCG1_HUMAN | Phospholipase C, gamma 1
Type:
Enzyme Catalytic Domain
Mol. Mass.:
115282.60
Organism:
Homo sapiens (Human)
Description:
gi_223459640
Residue:
999
  
Inhibitor
Name:
BDBM114294
Synonyms:
1-bromanyl-4-[(4-bromophenyl)sulfonylmethylsulfonyl]benzene 1-bromo-4-[(4-bromophenyl)sulfonylmethylsulfonyl]benzene SMR001875168 | cid_340220
Type:
Small organic molecule
Emp. Form.:
C13H10Br2O4S2
Mol. Mass.:
454.154
SMILES:
Brc1ccc(cc1)S(=O)(=O)CS(=O)(=O)c1ccc(Br)cc1
: