Target
1-phosphatidylinositol 4,5-bisphosphate phosphodiesterase gamma-1 [1-999,I813T]
Ligand
BDBM114295
Substrate
Meas. Tech.
Counterscreen for inhibitors of phospholipase C isozymes (PLC-B3): Fluorescence-based biochemical high throughput dose response assay to identify inhibitors of phospholipase C isozymes (PLC-gamma1)
IC50
82166±n/a nM
Citation
 PubChem, PC Counterscreen for inhibitors of phospholipase C isozymes (PLC-B3): Fluorescence-based biochemical high throughput dose response assay to identify inhibitors of phospholipase C isozymes (PLC-gamma1) PubChem Bioassay (2014)[AID] 
Target
Name:
1-phosphatidylinositol 4,5-bisphosphate phosphodiesterase gamma-1 [1-999,I813T]
Synonyms:
PLC1 PLCG1_HUMAN | Phospholipase C, gamma 1
Type:
Enzyme Catalytic Domain
Mol. Mass.:
115282.60
Organism:
Homo sapiens (Human)
Description:
gi_223459640
Residue:
999
  
Inhibitor
Name:
BDBM114295
Synonyms:
(6R)-1-[2-[3,5-bis(trifluoromethyl)phenyl]ethyl]-6-(4-hydroxybenzyl)piperazine-2,3-quinone MLS002477314 cid_53299348
Type:
Small organic molecule
Emp. Form.:
C21H18F6N2O3
Mol. Mass.:
460.3696
SMILES:
Oc1ccc(C[C@@H]2CNC(=O)C(=O)N2CCc2cc(cc(c2)C(F)(F)F)C(F)(F)F)cc1
: