Target
Major prion protein
Ligand
BDBM114355
Substrate
Meas. Tech.
TRFRET-based cell-based high throughput dose response assay to identify inhibitors of cell surface Prion Protein (PRPC)
IC50
320.71±n/a nM
Citation
 PubChem, PC TRFRET-based cell-based high throughput dose response assay to identify inhibitors of cell surface Prion Protein (PRPC) PubChem Bioassay (2014)[AID] 
Target
Name:
Major prion protein
Synonyms:
ALTPRP CD_antigen=CD230 PRIP PRP PrP33-35C major prion protein preproprotein
Type:
PROTEIN
Mol. Mass.:
27671.97
Organism:
Homo sapiens (Human)
Description:
ChEMBL_158887
Residue:
253
  
Inhibitor
Name:
BDBM114355
Synonyms:
2-(4-ethoxyphenyl)-3,4-dimethyl-2,6-dihydro-7H-pyrazolo[3,4-d]pyridazine-7-thione 3,4-dimethyl-2-p-phenetyl-6H-pyrazolo[3,4-d]pyridazine-7-thione SMR000229593 | cid_1234242
Type:
Small organic molecule
Emp. Form.:
C15H16N4OS
Mol. Mass.:
300.379
SMILES:
CCOc1ccc(cc1)-n1nc2c(c1C)c(C)n[nH]c2=S
: