Target
Major prion protein
Ligand
BDBM114431
Substrate
Meas. Tech.
TRFRET-based cell-based high throughput dose response assay to identify inhibitors of cell surface Prion Protein (PRPC)
IC50
1160±n/a nM
Citation
 PubChem, PC TRFRET-based cell-based high throughput dose response assay to identify inhibitors of cell surface Prion Protein (PRPC) PubChem Bioassay (2014)[AID] 
Target
Name:
Major prion protein
Synonyms:
ALTPRP CD_antigen=CD230 PRIP PRP PrP33-35C major prion protein preproprotein
Type:
PROTEIN
Mol. Mass.:
27671.97
Organism:
Homo sapiens (Human)
Description:
ChEMBL_158887
Residue:
253
  
Inhibitor
Name:
BDBM114431
Synonyms:
5-[[(4-bromo-2,5-dimethyl-pyrazole-3-carbonyl)amino]thiocarbamoylamino]-3-methyl-thiophene-2,4-dicarboxylic acid dimethyl ester MLS001035785 cid_2205361 dimethyl 5-[[(4-bromo-2,5-dimethylpyrazole-3-carbonyl)amino]carbamothioylamino]-3-methylthiophene-2,4-dicarboxylate
Type:
Small organic molecule
Emp. Form.:
C16H18BrN5O5S2
Mol. Mass.:
504.379
SMILES:
COC(=O)c1sc(NC(=S)NNC(=O)c2c(Br)c(C)nn2C)c(C(=O)OC)c1C
: