Target
Group 3 secretory phospholipase A2
Ligand
BDBM63667
Substrate
Meas. Tech.
QFRET-based biochemical high throughput dose response assay to identify inhibitors of human group III secreted phospholipase A2 enzyme (HGIII-sPLA2)
IC50
50617±n/a nM
Citation
 PubChem, PC QFRET-based biochemical high throughput dose response assay to identify inhibitors of human group III secreted phospholipase A2 enzyme (HGIII-sPLA2) PubChem Bioassay (2014)[AID] 
Target
Name:
Group 3 secretory phospholipase A2
Synonyms:
3.1.1.4 Group III secretory phopholipase A2 PA2G3_HUMAN Phosphatidylcholine 2-acylhydrolase 3 sPLA2-III
Type:
PROTEIN
Mol. Mass.:
57196.58
Organism:
Homo sapiens
Description:
ChEMBL_119722
Residue:
509
  
Inhibitor
Name:
BDBM63667
Synonyms:
4-(2-fluorophenyl)-2-methylimino-N-[(Z)-2-pyrrolylidenemethyl]-3-thiazolamine MLS000516531 [4-(2-fluorophenyl)-2-methylimino-4-thiazolin-3-yl]-[(Z)-pyrrol-2-ylidenemethyl]amine | cid_16195963
Type:
Small organic molecule
Emp. Form.:
C15H13FN4S
Mol. Mass.:
300.354
SMILES:
CN=c1scc(-c2ccccc2F)n1N=Cc1ccc[nH]1
: