Target
Group 3 secretory phospholipase A2
Ligand
BDBM94677
Substrate
Meas. Tech.
QFRET-based biochemical high throughput dose response assay to identify inhibitors of human group III secreted phospholipase A2 enzyme (HGIII-sPLA2)
IC50
30099±n/a nM
Citation
 PubChem, PC QFRET-based biochemical high throughput dose response assay to identify inhibitors of human group III secreted phospholipase A2 enzyme (HGIII-sPLA2) PubChem Bioassay (2014)[AID] 
Target
Name:
Group 3 secretory phospholipase A2
Synonyms:
3.1.1.4 Group III secretory phopholipase A2 PA2G3_HUMAN Phosphatidylcholine 2-acylhydrolase 3 sPLA2-III
Type:
PROTEIN
Mol. Mass.:
57196.58
Organism:
Homo sapiens
Description:
ChEMBL_119722
Residue:
509
  
Inhibitor
Name:
BDBM94677
Synonyms:
MLS001018570 N,N-dimethyl-4-[(E)-2-(1-methylquinolin-1-ium-4-yl)ethenyl]aniline;perchlorate cid_16196127 dimethyl-[4-[(E)-2-(1-methylquinolin-1-ium-4-yl)vinyl]phenyl]amine;perchlorate
Type:
Small organic molecule
Emp. Form.:
C20H21N2
Mol. Mass.:
289.3936
SMILES:
CN(C)c1ccc(\C=C\c2cc[n+](C)c3ccccc23)cc1
: