Target
Mu-type opioid receptor
Ligand
BDBM114612
Substrate
Meas. Tech.
Late stage Counterscreen for the probe development effort to identify agonists of the mouse 5-hydroxytryptamine (serotonin) receptor 2A (HTR2A)
EC50
92470±n/a nM
Citation
 PubChem, PC Late stage Counterscreen for the probe development effort to identify agonists of the mouse 5-hydroxytryptamine (serotonin) receptor 2A (HTR2A): Luminescence-based cell-based high throughput dose response assay to identify agonists of the mu 1 opioid receptor (OPRM1) PubChem Bioassay (2013)[AID] 
Target
Name:
Mu-type opioid receptor
Synonyms:
M-OR-1 MOR-1 MUOR1 Mu opiate receptor OPRM1 hMOP | mu-type opioid receptor isoform MOR-1
Type:
G Protein-Coupled Receptor (GPCR)
Mol. Mass.:
44789.51
Organism:
Homo sapiens (Human)
Description:
P35372
Residue:
400
  
Inhibitor
Name:
BDBM114612
Synonyms:
2-(4-benzylpiperazin-1-yl)pyrimidine 2-[4-(phenylmethyl)-1-piperazinyl]pyrimidine SR-01000788047 cid_3716622
Type:
Small organic molecule
Emp. Form.:
C15H18N4
Mol. Mass.:
254.3302
SMILES:
C(N1CCN(CC1)c1ncccn1)c1ccccc1
: