Target
Mu-type opioid receptor
Ligand
BDBM50325274
Substrate
Meas. Tech.
Late stage Counterscreen for the probe development effort to identify agonists of the mouse 5-hydroxytryptamine (serotonin) receptor 2A (HTR2A)
EC50
92470±n/a nM
Citation
 PubChem, PC Late stage Counterscreen for the probe development effort to identify agonists of the mouse 5-hydroxytryptamine (serotonin) receptor 2A (HTR2A): Luminescence-based cell-based high throughput dose response assay to identify agonists of the mu 1 opioid receptor (OPRM1) PubChem Bioassay (2013)[AID] 
Target
Name:
Mu-type opioid receptor
Synonyms:
M-OR-1 MOR-1 MUOR1 Mu opiate receptor OPRM1 hMOP | mu-type opioid receptor isoform MOR-1
Type:
G Protein-Coupled Receptor (GPCR)
Mol. Mass.:
44789.51
Organism:
Homo sapiens (Human)
Description:
P35372
Residue:
400
  
Inhibitor
Name:
BDBM50325274
Synonyms:
4-{2-[3-(4-Hydroxy-phenyl)-1-methyl-propylamino]-ethyl}-benzene-1,2-diol CHEMBL926 Dobutrex | cid_36811
Type:
Small organic molecule
Emp. Form.:
C18H23NO3
Mol. Mass.:
301.3801
SMILES:
CC(CCc1ccc(O)cc1)NCCc1ccc(O)c(O)c1
: