Target
5-hydroxytryptamine receptor 2A
Ligand
BDBM114606
Substrate
Meas. Tech.
Late stage for the probe development effort to identify agonists of the mouse 5-hydroxytryptamine (serotonin) receptor 2A (HTR2A)
EC50
76083±n/a nM
Citation
 PubChem, PC Late stage for the probe development effort to identify agonists of the mouse 5-hydroxytryptamine (serotonin) receptor 2A (HTR2A): Luminescence-based cell-based high throughput dose response assay for agonists of the mouse 5-hydroxytryptamine (serotonin) receptor 2A (HTR2A) PubChem Bioassay (2013)[AID] 
Target
Name:
5-hydroxytryptamine receptor 2A
Synonyms:
5-HT-2 5-hydroxytryptamine receptor 2A 5HT2A_MOUSE Htr2 Serotonin 2a (5-HT2a) receptor
Type:
Enzyme
Mol. Mass.:
52843.00
Organism:
Mus musculus (Mouse)
Description:
P35363
Residue:
471
  
Inhibitor
Name:
BDBM114606
Synonyms:
2-[4-(3-methylbenzyl)piperazino]pyrimidine 2-[4-[(3-methylphenyl)methyl]piperazin-1-yl]pyrimidine SR-01000201419-3 | cid_750803
Type:
Small organic molecule
Emp. Form.:
C16H20N4
Mol. Mass.:
268.3568
SMILES:
Cc1cccc(CN2CCN(CC2)c2ncccn2)c1
: