Target
5-hydroxytryptamine receptor 2A
Ligand
BDBM50033116
Substrate
Meas. Tech.
Late stage for the probe development effort to identify agonists of the mouse 5-hydroxytryptamine (serotonin) receptor 2A (HTR2A)
EC50
76083±n/a nM
Citation
 PubChem, PC Late stage for the probe development effort to identify agonists of the mouse 5-hydroxytryptamine (serotonin) receptor 2A (HTR2A): Luminescence-based cell-based high throughput dose response assay for agonists of the mouse 5-hydroxytryptamine (serotonin) receptor 2A (HTR2A) PubChem Bioassay (2013)[AID] 
Target
Name:
5-hydroxytryptamine receptor 2A
Synonyms:
5-HT-2 5-hydroxytryptamine receptor 2A 5HT2A_MOUSE Htr2 Serotonin 2a (5-HT2a) receptor
Type:
Enzyme
Mol. Mass.:
52843.00
Organism:
Mus musculus (Mouse)
Description:
P35363
Residue:
471
  
Inhibitor
Name:
BDBM50033116
Synonyms:
(1R,3S)-3-Adamantan-1-yl-1-aminomethyl-isochroman-5,6-diol CHEMBL291143 | cid_6603703
Type:
Small organic molecule
Emp. Form.:
C20H27NO3
Mol. Mass.:
329.4333
SMILES:
NC[C@@H]1O[C@@H](Cc2c(O)c(O)ccc12)C12CC3CC(CC(C3)C1)C2
: