Target
5-hydroxytryptamine receptor 2A
Ligand
BDBM114632
Substrate
Meas. Tech.
Late stage for the probe development effort to identify agonists of the mouse 5-hydroxytryptamine (serotonin) receptor 2A (HTR2A)
EC50
76083±n/a nM
Citation
 PubChem, PC Late stage for the probe development effort to identify agonists of the mouse 5-hydroxytryptamine (serotonin) receptor 2A (HTR2A): Luminescence-based cell-based high throughput dose response assay for agonists of the mouse 5-hydroxytryptamine (serotonin) receptor 2A (HTR2A) PubChem Bioassay (2013)[AID] 
Target
Name:
5-hydroxytryptamine receptor 2A
Synonyms:
5-HT-2 5-hydroxytryptamine receptor 2A 5HT2A_MOUSE Htr2 Serotonin 2a (5-HT2a) receptor
Type:
Enzyme
Mol. Mass.:
52843.00
Organism:
Mus musculus (Mouse)
Description:
P35363
Residue:
471
  
Inhibitor
Name:
BDBM114632
Synonyms:
2-[4-(3-bromobenzyl)piperazino]pyrimidine 2-[4-[(3-bromophenyl)methyl]piperazin-1-yl]pyrimidine SR-01000202666-3 | cid_754229
Type:
Small organic molecule
Emp. Form.:
C15H17BrN4
Mol. Mass.:
333.226
SMILES:
Brc1cccc(CN2CCN(CC2)c2ncccn2)c1
: