Target
Methyl-CpG-binding domain protein 2
Ligand
BDBM53262
Substrate
Meas. Tech.
TRFRET-based biochemical high throughput dose response assay to identify inhibitors of 5-meCpG-binding domain protein 2 (MBD2)-DBD binding to methylated oligonucleotide
IC50
4867±n/a nM
Citation
 PubChem, PC TRFRET-based biochemical high throughput dose response assay to identify inhibitors of 5-meCpG-binding domain protein 2 (MBD2)-DBD binding to methylated oligonucleotide PubChem Bioassay (2013)[AID] 
Target
Name:
Methyl-CpG-binding domain protein 2
Synonyms:
MBD2 Methyl-CpG binding domain protein 2 | Methyl-CpG-binding domain protein 2 (MBD2)
Type:
Enzyme Catalytic Domain
Mol. Mass.:
43278.74
Organism:
Homo sapiens (Human)
Description:
gi_21595776
Residue:
411
  
Inhibitor
Name:
BDBM53262
Synonyms:
2-[4-[(4-chlorophenyl)sulfonylamino]-1-hydroxynaphthalen-2-yl]sulfanylacetic acid 2-[[4-[(4-chlorophenyl)sulfonylamino]-1-hydroxy-2-naphthalenyl]thio]acetic acid MLS001196186 [(4-{[(4-chlorophenyl)sulfonyl]amino}-1-hydroxy-2-naphthyl)thio]acetic acid | cid_1309516
Type:
Small organic molecule
Emp. Form.:
C18H14ClNO5S2
Mol. Mass.:
423.89
SMILES:
OC(=O)CSc1cc(NS(=O)(=O)c2ccc(Cl)cc2)c2ccccc2c1O
: