Target
Methyl-CpG-binding domain protein 2
Ligand
BDBM53102
Substrate
Meas. Tech.
TRFRET-based biochemical high throughput dose response assay to identify inhibitors of 5-meCpG-binding domain protein 2 (MBD2)-DBD binding to methylated oligonucleotide
IC50
43816±n/a nM
Citation
 PubChem, PC TRFRET-based biochemical high throughput dose response assay to identify inhibitors of 5-meCpG-binding domain protein 2 (MBD2)-DBD binding to methylated oligonucleotide PubChem Bioassay (2013)[AID] 
Target
Name:
Methyl-CpG-binding domain protein 2
Synonyms:
MBD2 Methyl-CpG binding domain protein 2 | Methyl-CpG-binding domain protein 2 (MBD2)
Type:
Enzyme Catalytic Domain
Mol. Mass.:
43278.74
Organism:
Homo sapiens (Human)
Description:
gi_21595776
Residue:
411
  
Inhibitor
Name:
BDBM53102
Synonyms:
MLS001164912 N,10-dimethylphenazin-10-ium-2-amine;perchlorate cid_10860295 | methyl-(10-methylphenazin-10-ium-2-yl)amine;perchlorate
Type:
Small organic molecule
Emp. Form.:
C14H14N3
Mol. Mass.:
224.2805
SMILES:
C\[NH+]=c1/ccc2nc3ccccc3n(C)c2c1
: