Target
Methyl-CpG-binding domain protein 2
Ligand
BDBM114652
Substrate
Meas. Tech.
TRFRET-based biochemical high throughput dose response assay to identify inhibitors of 5-meCpG-binding domain protein 2 (MBD2)-DBD binding to methylated oligonucleotide
IC50
4073±n/a nM
Citation
 PubChem, PC TRFRET-based biochemical high throughput dose response assay to identify inhibitors of 5-meCpG-binding domain protein 2 (MBD2)-DBD binding to methylated oligonucleotide PubChem Bioassay (2013)[AID] 
Target
Name:
Methyl-CpG-binding domain protein 2
Synonyms:
MBD2 Methyl-CpG binding domain protein 2 | Methyl-CpG-binding domain protein 2 (MBD2)
Type:
Enzyme Catalytic Domain
Mol. Mass.:
43278.74
Organism:
Homo sapiens (Human)
Description:
gi_21595776
Residue:
411
  
Inhibitor
Name:
BDBM114652
Synonyms:
CHEMBL1706858 N-[3-(1,3-benzothiazol-2-yl)-5,6-dihydro-4H-thieno[2,3-c]pyrrol-2-yl]acetamide;2,2,2-trifluoroacetic acid SMR001522662 | cid_60138096
Type:
Small organic molecule
Emp. Form.:
C15H13N3OS2
Mol. Mass.:
315.413
SMILES:
CC(=O)Nc1sc2CNCc2c1-c1nc2ccccc2s1
: