Target
Fibrinogen beta chain [164-491]
Ligand
BDBM114659
Substrate
Meas. Tech.
Fluorescence polarization-based biochemical high throughput dose response assay to identify inhibitors that disrupt the binding of a cyclic peptide (Tn6) to the fibrin proteolytic product D-Dimer
IC50
83293±n/a nM
Citation
 PubChem, PC Fluorescence polarization-based biochemical high throughput dose response assay to identify inhibitors that disrupt the binding of a cyclic peptide (Tn6) to the fibrin proteolytic product D-Dimer and fragment E complex [DD(E )] PubChem Bioassay (2013)[AID] 
Target
Name:
Fibrinogen beta chain [164-491]
Synonyms:
Chain E, Fragment Double-D From Human Fibrin FIBB_HUMAN
Type:
Enzyme Catalytic Domain
Mol. Mass.:
37647.12
Organism:
Homo sapiens (Human)
Description:
gi_28373962
Residue:
328
  
Inhibitor
Name:
BDBM114659
Synonyms:
2-(1-naphthalenyl)-4-quinolinecarboxylic acid [2-[(1,1-dioxo-3-thiolanyl)amino]-2-oxoethyl] ester MLS000334003 [2-[(1,1-dioxothiolan-3-yl)amino]-2-oxoethyl] 2-naphthalen-1-ylquinoline-4-carboxylate cid_3938639
Type:
Small organic molecule
Emp. Form.:
C26H22N2O5S
Mol. Mass.:
474.528
SMILES:
O=C(COC(=O)c1cc(nc2ccccc12)-c1cccc2ccccc12)NC1CCS(=O)(=O)C1
: