Target
Protein artemis
Ligand
BDBM31045
Substrate
Meas. Tech.
Dose Response confirmation of small molecule inhibitors originally identified via uHTS of Artemis endonuclease activity via a fluorescence intensity assay
IC50
3810±n/a nM
Citation
 PubChem, PC Dose Response confirmation of small molecule inhibitors originally identified via uHTS of Artemis endonuclease activity via a fluorescence intensity assay PubChem Bioassay (2013)[AID] 
Target
Name:
Protein artemis
Synonyms:
ARTEMIS DCLRE1C SCIDA protein artemis isoform a
Type:
Enzyme Catalytic Domain
Mol. Mass.:
78427.91
Organism:
Homo sapiens (Human)
Description:
gi_76496497
Residue:
692
  
Inhibitor
Name:
BDBM31045
Synonyms:
1-Ethyl-4-hydroxy-2-oxo-1,2-dihydro-quinoline-3-carboxylic acid (1H-benzoimidazol-2-yl)-amide N-(1H-benzimidazol-2-yl)-1-ethyl-2-hydroxy-4-keto-quinoline-3-carboxamide N-(1H-benzimidazol-2-yl)-1-ethyl-2-hydroxy-4-oxoquinoline-3-carboxamide N-(1H-benzimidazol-2-yl)-1-ethyl-4-hydroxy-2-keto-quinoline-3-carboxamide cid_654742
Type:
Small organic molecule
Emp. Form.:
C19H16N4O3
Mol. Mass.:
348.3553
SMILES:
CCn1c2ccccc2c(O)c(C(=O)Nc2nc3ccccc3[nH]2)c1=O
: