Target
Protein artemis
Ligand
BDBM34245
Substrate
Meas. Tech.
Dose Response confirmation of small molecule inhibitors originally identified via uHTS of Artemis endonuclease activity via a fluorescence intensity assay
IC50
11500±n/a nM
Citation
 PubChem, PC Dose Response confirmation of small molecule inhibitors originally identified via uHTS of Artemis endonuclease activity via a fluorescence intensity assay PubChem Bioassay (2013)[AID] 
Target
Name:
Protein artemis
Synonyms:
ARTEMIS DCLRE1C SCIDA protein artemis isoform a
Type:
Enzyme Catalytic Domain
Mol. Mass.:
78427.91
Organism:
Homo sapiens (Human)
Description:
gi_76496497
Residue:
692
  
Inhibitor
Name:
BDBM34245
Synonyms:
2-hydroxy-6-(piperidine-1-carbonyl)benzo[de]isoquinoline-1,3-dione 2-hydroxy-6-[oxo(1-piperidinyl)methyl]benzo[de]isoquinoline-1,3-dione MLS000080235 cid_659314
Type:
Small organic molecule
Emp. Form.:
C18H16N2O4
Mol. Mass.:
324.3306
SMILES:
ON1C(=O)c2cccc3c(ccc(C1=O)c23)C(=O)N1CCCCC1
: