Target
Protein artemis
Ligand
BDBM114677
Substrate
Meas. Tech.
Dose Response confirmation of small molecule inhibitors originally identified via uHTS of Artemis endonuclease activity via a fluorescence intensity assay
IC50
20000±n/a nM
Citation
 PubChem, PC Dose Response confirmation of small molecule inhibitors originally identified via uHTS of Artemis endonuclease activity via a fluorescence intensity assay PubChem Bioassay (2013)[AID] 
Target
Name:
Protein artemis
Synonyms:
ARTEMIS DCLRE1C SCIDA protein artemis isoform a
Type:
Enzyme Catalytic Domain
Mol. Mass.:
78427.91
Organism:
Homo sapiens (Human)
Description:
gi_76496497
Residue:
692
  
Inhibitor
Name:
BDBM114677
Synonyms:
MLS000082295 N-(1-butyl-3-cyano-10-methyl-5-oxo-2-dipyrido[3,4-c:1',2'-f]pyrimidinylidene)-1,3-benzodioxole-5-carboxamide N-(1-butyl-3-cyano-5-keto-10-methyl-dipyrido[3,4-c:1',2'-f]pyrimidin-2-ylidene)-piperonylamide cid_665448
Type:
Small organic molecule
Emp. Form.:
C25H21N5O4
Mol. Mass.:
455.4653
SMILES:
CCCCn1c2nc3c(C)cccn3c(=O)c2cc(C#N)\c1=N/C(=O)c1ccc2OCOc2c1
: