Target
Protein artemis
Ligand
BDBM50293843
Substrate
Meas. Tech.
Dose Response confirmation of small molecule inhibitors originally identified via uHTS of Artemis endonuclease activity via a fluorescence intensity assay
IC50
20000±n/a nM
Citation
 PubChem, PC Dose Response confirmation of small molecule inhibitors originally identified via uHTS of Artemis endonuclease activity via a fluorescence intensity assay PubChem Bioassay (2013)[AID] 
Target
Name:
Protein artemis
Synonyms:
ARTEMIS DCLRE1C SCIDA protein artemis isoform a
Type:
Enzyme Catalytic Domain
Mol. Mass.:
78427.91
Organism:
Homo sapiens (Human)
Description:
gi_76496497
Residue:
692
  
Inhibitor
Name:
BDBM50293843
Synonyms:
1,8-diamino-6-methoxy-3-(4-(2-methoxyphenyl)piperazin-1-yl)-2,7-naphthyridine-4-carbonitrile cid_2999946
Type:
Small organic molecule
Emp. Form.:
C21H23N7O2
Mol. Mass.:
405.453
SMILES:
COc1cc2c(C#N)c(nc(N)c2c(N)n1)N1CCN(CC1)c1ccccc1OC
: