Target
Protein artemis
Ligand
BDBM53693
Substrate
Meas. Tech.
Dose Response confirmation of small molecule inhibitors originally identified via uHTS of Artemis endonuclease activity via a fluorescence intensity assay
IC50
1400±n/a nM
Citation
 PubChem, PC Dose Response confirmation of small molecule inhibitors originally identified via uHTS of Artemis endonuclease activity via a fluorescence intensity assay PubChem Bioassay (2013)[AID] 
Target
Name:
Protein artemis
Synonyms:
ARTEMIS DCLRE1C SCIDA protein artemis isoform a
Type:
Enzyme Catalytic Domain
Mol. Mass.:
78427.91
Organism:
Homo sapiens (Human)
Description:
gi_76496497
Residue:
692
  
Inhibitor
Name:
BDBM53693
Synonyms:
2-(2-phenyl-3-thienyl)ethanehydroxamic acid N-hydroxy-2-(2-phenyl-3-thiophenyl)acetamide N-hydroxy-2-(2-phenylthiophen-3-yl)acetamide SMR000024888 | cid_3786
Type:
Small organic molecule
Emp. Form.:
C12H11NO2S
Mol. Mass.:
233.286
SMILES:
ONC(=O)Cc1ccsc1-c1ccccc1
: