Target
Protein artemis
Ligand
BDBM95056
Substrate
Meas. Tech.
Dose Response confirmation of small molecule inhibitors originally identified via uHTS of Artemis endonuclease activity via a fluorescence intensity assay
IC50
20000±n/a nM
Citation
 PubChem, PC Dose Response confirmation of small molecule inhibitors originally identified via uHTS of Artemis endonuclease activity via a fluorescence intensity assay PubChem Bioassay (2013)[AID] 
Target
Name:
Protein artemis
Synonyms:
ARTEMIS DCLRE1C SCIDA protein artemis isoform a
Type:
Enzyme Catalytic Domain
Mol. Mass.:
78427.91
Organism:
Homo sapiens (Human)
Description:
gi_76496497
Residue:
692
  
Inhibitor
Name:
BDBM95056
Synonyms:
2-(2-furanyl)-5-phenyl-1H-[1,2,4]triazolo[1,5-a]pyrimidin-7-one 2-(2-furyl)-5-phenyl[1,2,4]triazolo[1,5-a]pyrimidin-7(4H)-one MLS000066245 cid_1266395
Type:
Small organic molecule
Emp. Form.:
C15H10N4O2
Mol. Mass.:
278.2655
SMILES:
O=c1cc(nc2nc([nH]n12)-c1ccco1)-c1ccccc1
: