Target
Protein artemis
Ligand
BDBM40319
Substrate
Meas. Tech.
Dose Response confirmation of small molecule inhibitors originally identified via uHTS of Artemis endonuclease activity via a fluorescence intensity assay
IC50
2600±n/a nM
Citation
 PubChem, PC Dose Response confirmation of small molecule inhibitors originally identified via uHTS of Artemis endonuclease activity via a fluorescence intensity assay PubChem Bioassay (2013)[AID] 
Target
Name:
Protein artemis
Synonyms:
ARTEMIS DCLRE1C SCIDA protein artemis isoform a
Type:
Enzyme Catalytic Domain
Mol. Mass.:
78427.91
Organism:
Homo sapiens (Human)
Description:
gi_76496497
Residue:
692
  
Inhibitor
Name:
BDBM40319
Synonyms:
4-[(3,4-diketo-1-naphthyl)amino]benzoic acid ethyl ester MLS000519473 cid_691731 ethyl 4-[[3,4-bis(oxidanylidene)naphthalen-1-yl]amino]benzoate
Type:
Small organic molecule
Emp. Form.:
C19H15NO4
Mol. Mass.:
321.3267
SMILES:
CCOC(=O)c1ccc(NC2=CC(=O)C(=O)c3ccccc23)cc1
: