Target
Protein artemis
Ligand
BDBM94931
Substrate
Meas. Tech.
Dose Response confirmation of small molecule inhibitors originally identified via uHTS of Artemis endonuclease activity via a fluorescence intensity assay
IC50
6570±n/a nM
Citation
 PubChem, PC Dose Response confirmation of small molecule inhibitors originally identified via uHTS of Artemis endonuclease activity via a fluorescence intensity assay PubChem Bioassay (2013)[AID] 
Target
Name:
Protein artemis
Synonyms:
ARTEMIS DCLRE1C SCIDA protein artemis isoform a
Type:
Enzyme Catalytic Domain
Mol. Mass.:
78427.91
Organism:
Homo sapiens (Human)
Description:
gi_76496497
Residue:
692
  
Inhibitor
Name:
BDBM94931
Synonyms:
(6-bromo-4-phenyl-quinazolin-2-yl)-[(E)-(5-nitro-2-furyl)methyleneamino]amine 6-bromo-N-[(E)-(5-nitro-2-furanyl)methylideneamino]-4-phenyl-2-quinazolinamine MLS000529204 SMR000121679 | cid_9589687
Type:
Small organic molecule
Emp. Form.:
C19H12BrN5O3
Mol. Mass.:
438.234
SMILES:
[O-][N+](=O)c1ccc([CH-]\N=[NH+]\c2nc(-c3ccccc3)c3cc(Br)ccc3n2)o1
: