Target
Protein artemis
Ligand
BDBM114698
Substrate
Meas. Tech.
Dose Response confirmation of small molecule inhibitors originally identified via uHTS of Artemis endonuclease activity via a fluorescence intensity assay
IC50
20000±n/a nM
Citation
 PubChem, PC Dose Response confirmation of small molecule inhibitors originally identified via uHTS of Artemis endonuclease activity via a fluorescence intensity assay PubChem Bioassay (2013)[AID] 
Target
Name:
Protein artemis
Synonyms:
ARTEMIS DCLRE1C SCIDA protein artemis isoform a
Type:
Enzyme Catalytic Domain
Mol. Mass.:
78427.91
Organism:
Homo sapiens (Human)
Description:
gi_76496497
Residue:
692
  
Inhibitor
Name:
BDBM114698
Synonyms:
MLS000540789 N'-[(Z)-(3-hydroxy-4-keto-cyclohexa-2,5-dien-1-ylidene)methyl]-9H-xanthene-9-carbohydrazide N'-[(Z)-(3-hydroxy-4-oxocyclohexa-2,5-dien-1-ylidene)methyl]-9H-xanthene-9-carbohydrazide SMR000162206 | cid_5434187
Type:
Small organic molecule
Emp. Form.:
C21H16N2O4
Mol. Mass.:
360.3627
SMILES:
Oc1ccc(C=NNC(=O)C2c3ccccc3Oc3ccccc23)cc1O
: