Target
Protein artemis
Ligand
BDBM114708
Substrate
Meas. Tech.
Dose Response confirmation of small molecule inhibitors originally identified via uHTS of Artemis endonuclease activity via a fluorescence intensity assay
IC50
20000±n/a nM
Citation
 PubChem, PC Dose Response confirmation of small molecule inhibitors originally identified via uHTS of Artemis endonuclease activity via a fluorescence intensity assay PubChem Bioassay (2013)[AID] 
Target
Name:
Protein artemis
Synonyms:
ARTEMIS DCLRE1C SCIDA protein artemis isoform a
Type:
Enzyme Catalytic Domain
Mol. Mass.:
78427.91
Organism:
Homo sapiens (Human)
Description:
gi_76496497
Residue:
692
  
Inhibitor
Name:
BDBM114708
Synonyms:
3-(2-naphthalenyl)-N-[(E)-thiophen-2-ylmethylideneamino]-1H-pyrazole-5-carboxamide 3-(2-naphthyl)-N-[(E)-2-thenylideneamino]-1H-pyrazole-5-carboxamide MLS000577764 cid_5342869
Type:
Small organic molecule
Emp. Form.:
C19H14N4OS
Mol. Mass.:
346.406
SMILES:
O=C(NN=Cc1cccs1)c1cc(n[nH]1)-c1ccc2ccccc2c1
: