Target
Protein artemis
Ligand
BDBM30835
Substrate
Meas. Tech.
Dose Response confirmation of small molecule inhibitors originally identified via uHTS of Artemis endonuclease activity via a fluorescence intensity assay
IC50
20000±n/a nM
Citation
 PubChem, PC Dose Response confirmation of small molecule inhibitors originally identified via uHTS of Artemis endonuclease activity via a fluorescence intensity assay PubChem Bioassay (2013)[AID] 
Target
Name:
Protein artemis
Synonyms:
ARTEMIS DCLRE1C SCIDA protein artemis isoform a
Type:
Enzyme Catalytic Domain
Mol. Mass.:
78427.91
Organism:
Homo sapiens (Human)
Description:
gi_76496497
Residue:
692
  
Inhibitor
Name:
BDBM30835
Synonyms:
3-(4-methoxyphenyl)-N-[3-(2-oxidanylidenepropyl)-1,2,4-thiadiazol-5-yl]-1-phenyl-pyrazole-4-carboxamide 3-(4-methoxyphenyl)-N-[3-(2-oxopropyl)-1,2,4-thiadiazol-5-yl]-1-phenylpyrazole-4-carboxamide N-(3-acetonyl-1,2,4-thiadiazol-5-yl)-3-(4-methoxyphenyl)-1-phenyl-pyrazole-4-carboxamide cid_2345621
Type:
Small organic molecule
Emp. Form.:
C22H19N5O3S
Mol. Mass.:
433.483
SMILES:
COc1ccc(cc1)-c1nn(cc1C(=O)Nc1nc(CC(C)=O)ns1)-c1ccccc1
: