Target
Protein artemis
Ligand
BDBM40226
Substrate
Meas. Tech.
Dose Response confirmation of small molecule inhibitors originally identified via uHTS of Artemis endonuclease activity via a fluorescence intensity assay
IC50
3190±n/a nM
Citation
 PubChem, PC Dose Response confirmation of small molecule inhibitors originally identified via uHTS of Artemis endonuclease activity via a fluorescence intensity assay PubChem Bioassay (2013)[AID] 
Target
Name:
Protein artemis
Synonyms:
ARTEMIS DCLRE1C SCIDA protein artemis isoform a
Type:
Enzyme Catalytic Domain
Mol. Mass.:
78427.91
Organism:
Homo sapiens (Human)
Description:
gi_76496497
Residue:
692
  
Inhibitor
Name:
BDBM40226
Synonyms:
(1-Benzenesulfonylamino-3-bromo-4-oxo-1,4-dihydro-naphthalen-1-yl)-phosphonic acid diethyl ester N-(3-bromanyl-1-diethoxyphosphoryl-4-oxidanylidene-naphthalen-1-yl)benzenesulfonamide N-(3-bromo-1-diethoxyphosphoryl-4-oxo-1-naphthalenyl)benzenesulfonamide SMR000145194 | cid_3757655
Type:
Small organic molecule
Emp. Form.:
C20H21BrNO6PS
Mol. Mass.:
514.327
SMILES:
CCOP(=O)(OCC)C1(NS(=O)(=O)c2ccccc2)C=C(Br)C(=O)c2ccccc12
: