Target
Protein artemis
Ligand
BDBM114712
Substrate
Meas. Tech.
Dose Response confirmation of small molecule inhibitors originally identified via uHTS of Artemis endonuclease activity via a fluorescence intensity assay
IC50
4520±n/a nM
Citation
 PubChem, PC Dose Response confirmation of small molecule inhibitors originally identified via uHTS of Artemis endonuclease activity via a fluorescence intensity assay PubChem Bioassay (2013)[AID] 
Target
Name:
Protein artemis
Synonyms:
ARTEMIS DCLRE1C SCIDA protein artemis isoform a
Type:
Enzyme Catalytic Domain
Mol. Mass.:
78427.91
Organism:
Homo sapiens (Human)
Description:
gi_76496497
Residue:
692
  
Inhibitor
Name:
BDBM114712
Synonyms:
2-[4-(4-chlorobenzyl)oxyphenyl]-5-(3-imidazol-1-ylpropylamino)oxazole-4-carbonitrile 2-[4-[(4-chlorophenyl)methoxy]phenyl]-5-[3-(1-imidazolyl)propylamino]-4-oxazolecarbonitrile SMR000045788 | cid_664765
Type:
Small organic molecule
Emp. Form.:
C23H20ClN5O2
Mol. Mass.:
433.89
SMILES:
Clc1ccc(COc2ccc(cc2)-c2nc(C#N)c(NCCCn3ccnc3)o2)cc1
: