Target
Protein artemis
Ligand
BDBM40048
Substrate
Meas. Tech.
Dose Response confirmation of small molecule inhibitors originally identified via uHTS of Artemis endonuclease activity via a fluorescence intensity assay
IC50
20000±n/a nM
Citation
 PubChem, PC Dose Response confirmation of small molecule inhibitors originally identified via uHTS of Artemis endonuclease activity via a fluorescence intensity assay PubChem Bioassay (2013)[AID] 
Target
Name:
Protein artemis
Synonyms:
ARTEMIS DCLRE1C SCIDA protein artemis isoform a
Type:
Enzyme Catalytic Domain
Mol. Mass.:
78427.91
Organism:
Homo sapiens (Human)
Description:
gi_76496497
Residue:
692
  
Inhibitor
Name:
BDBM40048
Synonyms:
6-bromanyl-2-(furan-2-yl)quinoline-4-carboxylic acid 6-bromo-2-(2-furyl)cinchoninic acid 6-bromo-2-(furan-2-yl)quinoline-4-carboxylic acid SMR000033614 | cid_686152
Type:
Small organic molecule
Emp. Form.:
C14H8BrNO3
Mol. Mass.:
318.122
SMILES:
OC(=O)c1cc(nc2ccc(Br)cc12)-c1ccco1
: