Target
Tegument protein VP16
Ligand
BDBM100208
Substrate
Meas. Tech.
Counterscreen for inhibitors of COUP-TFII (NR2F2): Luminescence-based cell-based high throughput dose response assay to identify inhibitors of the Herpes Virus Virion Protein 16 (VP16)
IC50
37918±n/a nM
Citation
 PubChem, PC Counterscreen for inhibitors of COUP-TFII (NR2F2): Luminescence-based cell-based high throughput dose response assay to identify inhibitors of the Herpes Virus Virion Protein 16 (VP16) PubChem Bioassay (2013)[AID] 
Target
Name:
Tegument protein VP16
Synonyms:
Alpha trans-inducing protein (VP16) transactivating tegument protein VP16
Type:
PROTEIN
Mol. Mass.:
54325.13
Organism:
Human herpesvirus 1 (strain 17) (HHV-1) (Human herpes simplex virus1)
Description:
EBI_100271
Residue:
490
  
Inhibitor
Name:
BDBM100208
Synonyms:
(E)-3-(4-bromophenyl)-1-(2-methyl-5,6,7,8-tetrahydroquinolin-3-yl)-2-propen-1-one 3-(4-bromophenyl)-1-(2-methyl-5,6,7,8-tetrahydro-3-quinolinyl)-2-propen-1-one SMR000185185 | cid_5338376
Type:
Small organic molecule
Emp. Form.:
C19H18BrNO
Mol. Mass.:
356.256
SMILES:
Cc1nc2CCCCc2cc1C(=O)C=Cc1ccc(Br)cc1
: