Target
Tegument protein VP16
Ligand
BDBM97161
Substrate
Meas. Tech.
Counterscreen for inhibitors of COUP-TFII (NR2F2): Luminescence-based cell-based high throughput dose response assay to identify inhibitors of the Herpes Virus Virion Protein 16 (VP16)
IC50
27843±n/a nM
Citation
 PubChem, PC Counterscreen for inhibitors of COUP-TFII (NR2F2): Luminescence-based cell-based high throughput dose response assay to identify inhibitors of the Herpes Virus Virion Protein 16 (VP16) PubChem Bioassay (2013)[AID] 
Target
Name:
Tegument protein VP16
Synonyms:
Alpha trans-inducing protein (VP16) transactivating tegument protein VP16
Type:
PROTEIN
Mol. Mass.:
54325.13
Organism:
Human herpesvirus 1 (strain 17) (HHV-1) (Human herpes simplex virus1)
Description:
EBI_100271
Residue:
490
  
Inhibitor
Name:
BDBM97161
Synonyms:
(2Z)-2-[[1-(2-methoxyphenyl)-2,6-dimethyl-4-pyridin-1-iumyl]methylidene]-3-methyl-1,3-benzothiazole;iodide (2Z)-2-[[1-(2-methoxyphenyl)-2,6-dimethyl-pyridin-1-ium-4-yl]methylidene]-3-methyl-1,3-benzothiazole;iodide MLS001332662 cid_16196349
Type:
Small organic molecule
Emp. Form.:
C23H23N2OS
Mol. Mass.:
375.506
SMILES:
COc1ccccc1-[n+]1c(C)cc(\C=C2/Sc3ccccc3N2C)cc1C
: