Target
Tegument protein VP16
Ligand
BDBM38908
Substrate
Meas. Tech.
Counterscreen for inhibitors of COUP-TFII (NR2F2): Luminescence-based cell-based high throughput dose response assay to identify inhibitors of the Herpes Virus Virion Protein 16 (VP16)
IC50
39611±n/a nM
Citation
 PubChem, PC Counterscreen for inhibitors of COUP-TFII (NR2F2): Luminescence-based cell-based high throughput dose response assay to identify inhibitors of the Herpes Virus Virion Protein 16 (VP16) PubChem Bioassay (2013)[AID] 
Target
Name:
Tegument protein VP16
Synonyms:
Alpha trans-inducing protein (VP16) transactivating tegument protein VP16
Type:
PROTEIN
Mol. Mass.:
54325.13
Organism:
Human herpesvirus 1 (strain 17) (HHV-1) (Human herpes simplex virus1)
Description:
EBI_100271
Residue:
490
  
Inhibitor
Name:
BDBM38908
Synonyms:
4-[4-(1,3-benzodioxol-5-ylmethyl)-1-piperazinyl]-7-methoxy-5H-pyrimido[5,4-b]indole 7-methoxy-4-(4-piperonylpiperazino)-5H-pyrimid[5,4-b]indole SMR000043796 | cid_663146
Type:
Small organic molecule
Emp. Form.:
C23H23N5O3
Mol. Mass.:
417.4604
SMILES:
COc1ccc2c(c1)[nH]c1c(ncnc21)N1CCN(Cc2ccc3OCOc3c2)CC1
: