Target
Tegument protein VP16
Ligand
BDBM100266
Substrate
Meas. Tech.
Counterscreen for inhibitors of COUP-TFII (NR2F2): Luminescence-based cell-based high throughput dose response assay to identify inhibitors of the Herpes Virus Virion Protein 16 (VP16)
IC50
28463±n/a nM
Citation
 PubChem, PC Counterscreen for inhibitors of COUP-TFII (NR2F2): Luminescence-based cell-based high throughput dose response assay to identify inhibitors of the Herpes Virus Virion Protein 16 (VP16) PubChem Bioassay (2013)[AID] 
Target
Name:
Tegument protein VP16
Synonyms:
Alpha trans-inducing protein (VP16) transactivating tegument protein VP16
Type:
PROTEIN
Mol. Mass.:
54325.13
Organism:
Human herpesvirus 1 (strain 17) (HHV-1) (Human herpes simplex virus1)
Description:
EBI_100271
Residue:
490
  
Inhibitor
Name:
BDBM100266
Synonyms:
4-acetyl-3,5-dimethyl-1H-pyrrole-2-carboxylic acid [2-[3-(diethylsulfamoyl)anilino]-2-keto-ethyl] ester MLS002169335 [2-[3-(diethylsulfamoyl)anilino]-2-oxoethyl] 4-acetyl-3,5-dimethyl-1H-pyrrole-2-carboxylate cid_4854166
Type:
Small organic molecule
Emp. Form.:
C21H27N3O6S
Mol. Mass.:
449.521
SMILES:
CCN(CC)S(=O)(=O)c1cccc(NC(=O)COC(=O)c2[nH]c(C)c(C(C)=O)c2C)c1
: