Target
Nuclear hormone receptor family member daf-12
Ligand
BDBM49531
Substrate
Meas. Tech.
Luminescence-based cell-based high throughput dose response assay to identify agonists of the DAF-12 from the parasite H. contortus (hcDAF-12)
EC50
67588±n/a nM
Citation
 PubChem, PC Luminescence-based cell-based high throughput dose response assay to identify agonists of the DAF-12 from the parasite H. contortus (hcDAF-12) PubChem Bioassay (2013)[AID] 
Target
Name:
Nuclear hormone receptor family member daf-12
Synonyms:
DAF12_CAEEL XL285 daf-20 | mig-7
Type:
Enzyme Catalytic Domain
Mol. Mass.:
84211.49
Organism:
Caenorhabditis elegans
Description:
gi_71987181
Residue:
753
  
Inhibitor
Name:
BDBM49531
Synonyms:
(6E)-6-[3-(2-methylphenyl)-2H-1,2-oxazol-5-ylidene]cyclohexa-2,4-dien-1-one (6E)-6-[3-(o-tolyl)-3-isoxazolin-5-ylidene]cyclohexa-2,4-dien-1-one MLS000570875 cid_11958868
Type:
Small organic molecule
Emp. Form.:
C16H13NO2
Mol. Mass.:
251.2799
SMILES:
Cc1ccccc1-c1cc(on1)-c1ccccc1O
: