Target
Nuclear hormone receptor family member daf-12
Ligand
BDBM76519
Substrate
Meas. Tech.
Luminescence-based cell-based high throughput dose response assay to identify agonists of the DAF-12 from the parasite H. contortus (hcDAF-12)
EC50
67602±n/a nM
Citation
 PubChem, PC Luminescence-based cell-based high throughput dose response assay to identify agonists of the DAF-12 from the parasite H. contortus (hcDAF-12) PubChem Bioassay (2013)[AID] 
Target
Name:
Nuclear hormone receptor family member daf-12
Synonyms:
DAF12_CAEEL XL285 daf-20 | mig-7
Type:
Enzyme Catalytic Domain
Mol. Mass.:
84211.49
Organism:
Caenorhabditis elegans
Description:
gi_71987181
Residue:
753
  
Inhibitor
Name:
BDBM76519
Synonyms:
(6E)-6-[(2E)-2-[(5Z)-5-(6-ketocyclohexa-2,4-dien-1-ylidene)-1,2,4-oxadiazolidin-3-ylidene]ethylidene]cyclohexa-2,4-dien-1-one (6E)-6-[(2E)-2-[(5Z)-5-(6-oxo-1-cyclohexa-2,4-dienylidene)-1,2,4-oxadiazolidin-3-ylidene]ethylidene]-1-cyclohexa-2,4-dienone 2-{2-[5-(2-hydroxyphenyl)-1,2,4-oxadiazol-3-yl]vinyl}phenol SMR000299118 | cid_16188892
Type:
Small organic molecule
Emp. Form.:
C16H12N2O3
Mol. Mass.:
280.2781
SMILES:
Oc1ccccc1C=Cc1noc(n1)-c1ccccc1O
: