Target
Nuclear hormone receptor family member daf-12
Ligand
BDBM114753
Substrate
Meas. Tech.
Luminescence-based cell-based high throughput dose response assay to identify agonists of the DAF-12 from the parasite H. contortus (hcDAF-12)
EC50
67602±n/a nM
Citation
 PubChem, PC Luminescence-based cell-based high throughput dose response assay to identify agonists of the DAF-12 from the parasite H. contortus (hcDAF-12) PubChem Bioassay (2013)[AID] 
Target
Name:
Nuclear hormone receptor family member daf-12
Synonyms:
DAF12_CAEEL XL285 daf-20 | mig-7
Type:
Enzyme Catalytic Domain
Mol. Mass.:
84211.49
Organism:
Caenorhabditis elegans
Description:
gi_71987181
Residue:
753
  
Inhibitor
Name:
BDBM114753
Synonyms:
(2-p-cumenylbenzotriazol-5-yl)amine 2-(4-propan-2-ylphenyl)benzotriazol-5-amine SMR000290976 | cid_960810
Type:
Small organic molecule
Emp. Form.:
C15H16N4
Mol. Mass.:
252.3143
SMILES:
CC(C)c1ccc(cc1)-n1nc2ccc(N)cc2n1
: