Target
Nuclear hormone receptor family member daf-12
Ligand
BDBM95946
Substrate
Meas. Tech.
Luminescence-based cell-based high throughput dose response assay to identify agonists of the DAF-12 from the parasite H. contortus (hcDAF-12)
EC50
67602±n/a nM
Citation
 PubChem, PC Luminescence-based cell-based high throughput dose response assay to identify agonists of the DAF-12 from the parasite H. contortus (hcDAF-12) PubChem Bioassay (2013)[AID] 
Target
Name:
Nuclear hormone receptor family member daf-12
Synonyms:
DAF12_CAEEL XL285 daf-20 | mig-7
Type:
Enzyme Catalytic Domain
Mol. Mass.:
84211.49
Organism:
Caenorhabditis elegans
Description:
gi_71987181
Residue:
753
  
Inhibitor
Name:
BDBM95946
Synonyms:
2-hydroxy-N-(2-naphthalenyl)benzamide 2-hydroxy-N-naphthalen-2-ylbenzamide N-naphthalen-2-yl-2-oxidanyl-benzamide cid_219325
Type:
Small organic molecule
Emp. Form.:
C17H13NO2
Mol. Mass.:
263.2906
SMILES:
Oc1ccccc1C(=O)Nc1ccc2ccccc2c1
: