Target
Nuclear hormone receptor family member daf-12
Ligand
BDBM114772
Substrate
Meas. Tech.
Luminescence-based cell-based high throughput dose response assay to identify activators of the DAF-12 from the parasite S. stercoralis (ssDAF-12)
IC50
67493±n/a nM
Citation
 PubChem, PC Luminescence-based cell-based high throughput dose response assay to identify activators of the DAF-12 from the parasite S. stercoralis (ssDAF-12) PubChem Bioassay (2013)[AID] 
Target
Name:
Nuclear hormone receptor family member daf-12
Synonyms:
DAF12_CAEEL XL285 daf-20 | mig-7
Type:
Enzyme Catalytic Domain
Mol. Mass.:
84211.49
Organism:
Caenorhabditis elegans
Description:
gi_71987181
Residue:
753
  
Inhibitor
Name:
BDBM114772
Synonyms:
(2Z)-2-(phenylhydrazinylidene)-1-benzothiophen-3-one 2-(Phenyl-hydrazono)-benzo[b]thiophen-3-one SMR000413502 | cid_5419037
Type:
Small organic molecule
Emp. Form.:
C14H10N2OS
Mol. Mass.:
254.307
SMILES:
Oc1c(N=Nc2ccccc2)sc2ccccc12
: