Target
Nuclear hormone receptor family member daf-12
Ligand
BDBM47509
Substrate
Meas. Tech.
Luminescence-based cell-based high throughput dose response assay to identify activators of the DAF-12 from the parasite S. stercoralis (ssDAF-12)
IC50
67475±n/a nM
Citation
 PubChem, PC Luminescence-based cell-based high throughput dose response assay to identify activators of the DAF-12 from the parasite S. stercoralis (ssDAF-12) PubChem Bioassay (2013)[AID] 
Target
Name:
Nuclear hormone receptor family member daf-12
Synonyms:
DAF12_CAEEL XL285 daf-20 | mig-7
Type:
Enzyme Catalytic Domain
Mol. Mass.:
84211.49
Organism:
Caenorhabditis elegans
Description:
gi_71987181
Residue:
753
  
Inhibitor
Name:
BDBM47509
Synonyms:
5-nitro-2-(2-pyrrolidin-1-ylethyl)benzo[de]isoquinoline-1,3-dione 5-nitro-2-[2-(1-pyrrolidinyl)ethyl]benzo[de]isoquinoline-1,3-dione Pinafide cid_327045
Type:
Small organic molecule
Emp. Form.:
C18H17N3O4
Mol. Mass.:
339.3453
SMILES:
[O-][N+](=O)c1cc2C(=O)N(CCN3CCCC3)C(=O)c3cccc(c1)c23
: