Target
Nuclear hormone receptor family member daf-12
Ligand
BDBM114800
Substrate
Meas. Tech.
Luminescence-based cell-based high throughput dose response assay to identify activators of the DAF-12 from the parasite S. stercoralis (ssDAF-12)
IC50
67498±n/a nM
Citation
 PubChem, PC Luminescence-based cell-based high throughput dose response assay to identify activators of the DAF-12 from the parasite S. stercoralis (ssDAF-12) PubChem Bioassay (2013)[AID] 
Target
Name:
Nuclear hormone receptor family member daf-12
Synonyms:
DAF12_CAEEL XL285 daf-20 | mig-7
Type:
Enzyme Catalytic Domain
Mol. Mass.:
84211.49
Organism:
Caenorhabditis elegans
Description:
gi_71987181
Residue:
753
  
Inhibitor
Name:
BDBM114800
Synonyms:
(3Z)-7-methyl-1H-indole-2,3-dione 3-(phenylhydrazone) 7-methyl-3-(N'-phenylhydrazino)indol-2-one MLS001194880 cid_5286407
Type:
Small organic molecule
Emp. Form.:
C15H13N3O
Mol. Mass.:
251.2832
SMILES:
Cc1cccc2=C(NNc3ccccc3)C(=O)N=c12
: