Target
Nuclear hormone receptor family member daf-12
Ligand
BDBM114936
Substrate
Meas. Tech.
Luminescence-based cell-based high throughput dose response assay to identify activators of the DAF-12 from the parasite S. stercoralis (ssDAF-12)
IC50
67456±n/a nM
Citation
 PubChem, PC Luminescence-based cell-based high throughput dose response assay to identify activators of the DAF-12 from the parasite S. stercoralis (ssDAF-12) PubChem Bioassay (2013)[AID] 
Target
Name:
Nuclear hormone receptor family member daf-12
Synonyms:
DAF12_CAEEL XL285 daf-20 | mig-7
Type:
Enzyme Catalytic Domain
Mol. Mass.:
84211.49
Organism:
Caenorhabditis elegans
Description:
gi_71987181
Residue:
753
  
Inhibitor
Name:
BDBM114936
Synonyms:
(E)-2-cyano-N-(2-fluorophenyl)-3-(1H-pyrrol-2-yl)-2-propenamide (E)-2-cyano-N-(2-fluorophenyl)-3-(1H-pyrrol-2-yl)prop-2-enamide SMR000678606 | cid_24818453
Type:
Small organic molecule
Emp. Form.:
C14H10FN3O
Mol. Mass.:
255.2471
SMILES:
Fc1ccccc1NC(=O)C(=C\c1ccc[nH]1)\C#N
: